Reaction Details
TargetLeukotriene B4 receptor 2
LigandBDBM50025845
Substrate/Competitorn/a
Ki 173±n/a nM
CommentsPDSP_922
Citation Wang, SGustafson, EPang, LQiao, XBehan, JMaguire, MBayne, MLaz, T A novel hepatointestinal leukotriene B4 receptor. Cloning and functional characterization. J Biol Chem275:40686-94 (2000) 
 
Leukotriene B4 receptor 2
Name:Leukotriene B4 receptor 2
Type:Enzyme Catalytic Domain
Mol. Mass.:37964.86
Organism:Homo sapiens (Human)
Description:Leukotriene 2 0 HUMAN::Q9NPC1
Residue:358
BDBM50025845
NameBDBM50025845
Synonyms:115-hydroxy-(5Z,8Z,11Z,13E,15R)-5,8,11,13-icosatetraenoic acid(15-HETE) CHEMBL8705 | HETE-15(S)
TypeSmall organic molecule
Emp. Form.C20H32O3
Mol. Mass.320.4663
SMILESCCCCC[C@@H](O)\C=C\C=C/C\C=C/C\C=C/CCCC(O)=O