Reaction Details
TargetLeukotriene B4 receptor 2
LigandBDBM85695
Substrate/Competitorn/a
Ki 1000±n/a nM
CommentsPDSP_923
Citation Wang, SGustafson, EPang, LQiao, XBehan, JMaguire, MBayne, MLaz, T A novel hepatointestinal leukotriene B4 receptor. Cloning and functional characterization. J Biol Chem275:40686-94 (2000) 
 
Leukotriene B4 receptor 2
Name:Leukotriene B4 receptor 2
Type:Enzyme Catalytic Domain
Mol. Mass.:37964.86
Organism:Homo sapiens (Human)
Description:Leukotriene 2 0 HUMAN::Q9NPC1
Residue:358
BDBM85695
NameBDBM85695
Synonyms:CAS_5283157 NSC_5283157
TypeSmall organic molecule
Emp. Form.C20H32O3
Mol. Mass.320.4663
SMILESOCCCCCC=CCC=CCC=CCC=CCCCC(O)=O