Reaction Details
TargetLeukotriene B4 receptor 2
LigandBDBM85684
Substrate/Competitorn/a
Ki 1000±n/a nM
CommentsPDSP_925
Citation Wang, SGustafson, EPang, LQiao, XBehan, JMaguire, MBayne, MLaz, T A novel hepatointestinal leukotriene B4 receptor. Cloning and functional characterization. J Biol Chem275:40686-94 (2000) 
 
Leukotriene B4 receptor 2
Name:Leukotriene B4 receptor 2
Type:Enzyme Catalytic Domain
Mol. Mass.:37964.86
Organism:Homo sapiens (Human)
Description:Leukotriene 2 0 HUMAN::Q9NPC1
Residue:358
BDBM85684
NameBDBM85684
Synonyms:CAS_5283163 NSC_5283163
TypeSmall organic molecule
Emp. Form.C20H32O3
Mol. Mass.320.4663
SMILESCCCCCC=CCC=CC=CC(O)CC=CCCCC(O)=O