Reaction Details
TargetLeukotriene B4 receptor 2
LigandBDBM85697
Substrate/Competitorn/a
Ki 1000±n/a nM
CommentsPDSP_1105
Citation Wang, SGustafson, EPang, LQiao, XBehan, JMaguire, MBayne, MLaz, T A novel hepatointestinal leukotriene B4 receptor. Cloning and functional characterization. J Biol Chem275:40686-94 (2000) 
 
Leukotriene B4 receptor 2
Name:Leukotriene B4 receptor 2
Type:Enzyme Catalytic Domain
Mol. Mass.:37964.86
Organism:Homo sapiens (Human)
Description:Leukotriene 2 0 HUMAN::Q9NPC1
Residue:358
BDBM85697
NameBDBM85697
Synonyms:LTB4-20-carboxy
TypeSmall organic molecule
Emp. Form.C21H32O5
Mol. Mass.364.4758
SMILESO[C@@H](CCCC(O)=O)\C=C/C=C/C=C/[C@H](O)C\C=C/CCCCCC=O