Reaction Details
TargetLeukotriene B4 receptor 2
LigandBDBM85696
Substrate/Competitorn/a
Ki 41±n/a nM
CommentsPDSP_1106
Citation Wang, SGustafson, EPang, LQiao, XBehan, JMaguire, MBayne, MLaz, T A novel hepatointestinal leukotriene B4 receptor. Cloning and functional characterization. J Biol Chem275:40686-94 (2000) 
 
Leukotriene B4 receptor 2
Name:Leukotriene B4 receptor 2
Type:Enzyme Catalytic Domain
Mol. Mass.:37964.86
Organism:Homo sapiens (Human)
Description:Leukotriene 2 0 HUMAN::Q9NPC1
Residue:358
BDBM85696
NameBDBM85696
Synonyms:LTB4-20-hydroxy
TypeSmall organic molecule
Emp. Form.C20H32O5
Mol. Mass.352.4651
SMILESOCCCCC\C=C/C[C@@H](O)\C=C\C=C\C=C/[C@@H](O)CCCC(O)=O