Reaction Details
TargetLeukotriene B4 receptor 2
LigandBDBM85692
Substrate/Competitorn/a
Ki 1227±n/a nM
CommentsPDSP_1107
Citation Wang, SGustafson, EPang, LQiao, XBehan, JMaguire, MBayne, MLaz, T A novel hepatointestinal leukotriene B4 receptor. Cloning and functional characterization. J Biol Chem275:40686-94 (2000) 
 
Leukotriene B4 receptor 2
Name:Leukotriene B4 receptor 2
Type:Enzyme Catalytic Domain
Mol. Mass.:37964.86
Organism:Homo sapiens (Human)
Description:Leukotriene 2 0 HUMAN::Q9NPC1
Residue:358
BDBM85692
NameBDBM85692
Synonyms:LTB4-3-aminopropylamide
TypeSmall organic molecule
Emp. Form.C23H40N2O3
Mol. Mass.392.5753
SMILESCCCCC\C=C/C[C@@H](O)\C=C\C=C\C=C/[C@@H](O)CCCC(=O)NCCCN