Reaction Details
TargetLeukotriene B4 receptor 2
LigandBDBM85694
Substrate/Competitorn/a
Ki 1000±n/a nM
CommentsPDSP_1113
Citation Wang, SGustafson, EPang, LQiao, XBehan, JMaguire, MBayne, MLaz, T A novel hepatointestinal leukotriene B4 receptor. Cloning and functional characterization. J Biol Chem275:40686-94 (2000) 
 
Leukotriene B4 receptor 2
Name:Leukotriene B4 receptor 2
Type:Enzyme Catalytic Domain
Mol. Mass.:37964.86
Organism:Homo sapiens (Human)
Description:Leukotriene 2 0 HUMAN::Q9NPC1
Residue:358
BDBM85694
NameBDBM85694
Synonyms:LTD3
TypeSmall organic molecule
Emp. Form.C25H42N2O6S
Mol. Mass.498.676
SMILESCCCCCCCCC=CC=CC=CC(SCC(N)C(=O)NCC(O)=O)C(O)CCCC(O)=O