Reaction Details
TargetLeukotriene B4 receptor 2
LigandBDBM85687
Substrate/Competitorn/a
Ki 4000±n/a nM
CommentsPDSP_1116
Citation Wang, SGustafson, EPang, LQiao, XBehan, JMaguire, MBayne, MLaz, T A novel hepatointestinal leukotriene B4 receptor. Cloning and functional characterization. J Biol Chem275:40686-94 (2000) 
 
Leukotriene B4 receptor 2
Name:Leukotriene B4 receptor 2
Type:Enzyme Catalytic Domain
Mol. Mass.:37964.86
Organism:Homo sapiens (Human)
Description:Leukotriene 2 0 HUMAN::Q9NPC1
Residue:358
BDBM85687
NameBDBM85687
Synonyms:LTE3
TypeSmall organic molecule
Emp. Form.C23H39NO5S
Mol. Mass.441.624
SMILESCCCCCCCCC=CC=CC=CC(SCC(N)C(O)=O)C(O)CCCC(O)=O