Reaction Details
TargetLeukotriene B4 receptor 2
LigandBDBM85700
Substrate/Competitorn/a
Ki 6000±n/a nM
CommentsPDSP_1118
Citation Wang, SGustafson, EPang, LQiao, XBehan, JMaguire, MBayne, MLaz, T A novel hepatointestinal leukotriene B4 receptor. Cloning and functional characterization. J Biol Chem275:40686-94 (2000) 
 
Leukotriene B4 receptor 2
Name:Leukotriene B4 receptor 2
Type:Enzyme Catalytic Domain
Mol. Mass.:37964.86
Organism:Homo sapiens (Human)
Description:Leukotriene 2 0 HUMAN::Q9NPC1
Residue:358
BDBM85700
NameBDBM85700
Synonyms:CAS_5283124 NSC_5283124
TypeSmall organic molecule
Emp. Form.C28H44N2O8S
Mol. Mass.568.723
SMILESCCCCCC=CCC=CC=CC=CC(SCC(NC(=O)CCC(N)C(O)=O)C(O)=O)C(O)CCCC(O)=O