Reaction Details
TargetMetabotropic glutamate receptor 1
LigandBDBM50030627
Substrate/Competitorn/a
Ki>10000±n/a nM
CommentsPDSP_2028
Citation Mutel, VEllis, GJAdam, GChaboz, SNilly, AMesser, JBleuel, ZMetzler, VMalherbe, PSchlaeger, EJRoughley, BSFaull, RLRichards, JG Characterization of [(3)H]Quisqualate binding to recombinant rat metabotropic glutamate 1a and 5a receptors and to rat and human brain sections. J Neurochem75:2590-601 (2000) 
 
Metabotropic glutamate receptor 1
Name:Metabotropic glutamate receptor 1
Type:Enzyme
Mol. Mass.:132358.19
Organism:Homo sapiens (Human)
Description:Q13255
Residue:1194
BDBM50030627
NameBDBM50030627
Synonyms:(+-)-MCPG 4-(1-Amino-1-carboxy-ethyl)-benzoic acid CHEMBL299683 | MCPG
TypeSmall organic molecule
Emp. Form.C10H11NO4
Mol. Mass.209.1986
SMILESCC(N)(C(O)=O)c1ccc(cc1)C(O)=O