Reaction Details
TargetSomatostatin receptor type 3
LigandBDBM85520
Substrate/Competitorn/a
Ki 127±n/a nM
CommentsPDSP_3370
Citation Reubi, JCSchaer, JCWenger, SHoeger, CErchegyi, JWaser, BRivier, J SST3-selective potent peptidic somatostatin receptor antagonists. Proc Natl Acad Sci U S A97:13973-8 (2000) 
 
Somatostatin receptor type 3
Name:Somatostatin receptor type 3
Type:Protein
Mol. Mass.:45855.97
Organism:Homo sapiens (Human)
Description:P32745
Residue:418
BDBM85520
NameBDBM85520
Synonyms:CAS_5311373 NSC_5311373
TypeSmall organic molecule
Emp. Form.C29H40N6O7
Mol. Mass.584.6639
SMILESCCCCC(NC(=O)NC(Cc1ccccc1)C(=O)Nc1ccc(cc1)[N+]([O-])=O)C(=O)NC(CCCCN)C(=O)OC