Reaction Details
Target5-hydroxytryptamine receptor 2C
LigandBDBM10755
Substrate/Competitorn/a
Ki 12.2±n/a nM
CommentsPDSP_150
Citation Rothman, RBBaumann, MHSavage, JERauser, LMcBride, AHufeisen, SJRoth, BL Evidence for possible involvement of 5-HT(2B) receptors in the cardiac valvulopathy associated with fenfluramine and other serotonergic medications. Circulation102:2836-41 (2000) 
 
5-hydroxytryptamine receptor 2C
Name:5-hydroxytryptamine receptor 2C
Type:Enzyme
Mol. Mass.:51935.10
Organism:Rattus norvegicus (Rat)
Description:P08909
Residue:460
BDBM10755
NameBDBM10755
Synonyms:14C-5-hydroxy tryptamine creatinine disulfate 5-HT 5-hydroxy tryptamine creatinine disulfate Serotonin | [3H]-5-HT
TypeSmall organic molecule
Emp. Form.C10H12N2O
Mol. Mass.176.2151
SMILESNCCc1c[nH]c2ccc(O)cc12