Reaction Details
Target5-hydroxytryptamine receptor 2C
LigandBDBM85530
Substrate/Competitorn/a
Ki 324±n/a nM
CommentsPDSP_1360
Citation Rothman, RBBaumann, MHSavage, JERauser, LMcBride, AHufeisen, SJRoth, BL Evidence for possible involvement of 5-HT(2B) receptors in the cardiac valvulopathy associated with fenfluramine and other serotonergic medications. Circulation102:2836-41 (2000) 
 
5-hydroxytryptamine receptor 2C
Name:5-hydroxytryptamine receptor 2C
Type:Enzyme
Mol. Mass.:51935.10
Organism:Rattus norvegicus (Rat)
Description:P08909
Residue:460
BDBM85530
NameBDBM85530
Synonyms:Nor-d-fenfluramine Norfenfluramine Norfenfluramine (-) | d-Norfenfluramine
TypeSmall organic molecule
Emp. Form.C10H12F3N
Mol. Mass.203.2042
SMILESC[C@H](N)Cc1cccc(c1)C(F)(F)F