Reaction Details
TargetP2X purinoceptor 3
LigandBDBM85730
Substrate/Competitorn/a
Ki 1000±n/a nM
CommentsPDSP_3350
Citation Lambrecht, G Agonists and antagonists acting at P2X receptors: selectivity profiles and functional implications. Naunyn Schmiedebergs Arch Pharmacol362:340-50 (2000) 
 
P2X purinoceptor 3
Name:P2X purinoceptor 3
Type:Enzyme Catalytic Domain
Mol. Mass.:44397.63
Organism:RAT
Description:Purinergic, P2X3 0 RAT::P49654
Residue:397
BDBM85730
NameBDBM85730
Synonyms:CAS_5311313 NSC_5311313
TypeSmall organic molecule
Emp. Form.C33H20N4O19S6
Mol. Mass.968.921
SMILES[O-]S(=O)(=O)c1cc(c2c(Nc3cccc(NC(=O)Nc4cccc(Nc5ccc(c6cc(cc(c56)S([O-])(=O)=O)S([O-])(=O)=O)S([O-])(=O)=O)c4)c3)ccc(c2c1)S([O-])(=O)=O)S([O-])(=O)=O