Reaction Details
Target5-hydroxytryptamine receptor 2C
LigandBDBM50252513
Substrate/Competitorn/a
Ki 48±n/a nM
CommentsPDSP_1600
Citation Richelson, ESouder, T Binding of antipsychotic drugs to human brain receptors focus on newer generation compounds. Life Sci68:29-39 (2000) 
 
5-hydroxytryptamine receptor 2C
Name:5-hydroxytryptamine receptor 2C
Type:G Protein-Coupled Receptor (GPCR)
Mol. Mass.:51836.79
Organism:Homo sapiens (Human)
Description:P28335
Residue:458
BDBM50252513
NameBDBM50252513
Synonyms:3-(2-(4-(6-fluorobenzo[d]isoxazol-3-yl)piperidin-1-yl)ethyl)-9-hydroxy-2-methyl-6,7,8,9-tetrahydropyrido[1,2-a]pyrimidin-4-one 9-hydroxy risperidone Invega | PALIPERIDONE
TypeSmall organic molecule
Emp. Form.C23H27FN4O3
Mol. Mass.426.4839
SMILESCc1nc2C(O)CCCn2c(=O)c1CCN1CCC(CC1)c1noc2cc(F)ccc12