Reaction Details
Target5-hydroxytryptamine receptor 2C
LigandBDBM50048803
Substrate/Competitorn/a
Ki 0.9±n/a nM
CommentsPDSP_1996
Citation Richelson, ESouder, T Binding of antipsychotic drugs to human brain receptors focus on newer generation compounds. Life Sci68:29-39 (2000) 
 
5-hydroxytryptamine receptor 2C
Name:5-hydroxytryptamine receptor 2C
Type:G Protein-Coupled Receptor (GPCR)
Mol. Mass.:51836.79
Organism:Homo sapiens (Human)
Description:P28335
Residue:458
BDBM50048803
NameBDBM50048803
Synonyms:5-(2-(4-(benzo[d]isothiazol-3-yl)piperazin-1-yl)ethyl)-6-chloroindolin-2-one 5-[2-(4-Benzo[d]isothiazol-3-yl-piperazin-1-yl)-ethyl]-6-chloro-1,3-dihydro-indol-2-one (Ziprasidone) CHEMBL708 ZIPRASIDONE | ZIPRASIDONE HYDROCHLORIDE
TypeSmall organic molecule
Emp. Form.C21H21ClN4OS
Mol. Mass.412.936
SMILESClc1cc2NC(=O)Cc2cc1CCN1CCN(CC1)c1nsc2ccccc12