Reaction Details
TargetAlpha-2A adrenergic receptor
LigandBDBM50252513
Substrate/Competitorn/a
Ki 80±n/a nM
CommentsPDSP_1600
Citation Richelson, ESouder, T Binding of antipsychotic drugs to human brain receptors focus on newer generation compounds. Life Sci68:29-39 (2000) 
 
Alpha-2A adrenergic receptor
Name:Alpha-2A adrenergic receptor
Type:Enzyme
Mol. Mass.:48979.91
Organism:Homo sapiens (Human)
Description:P08913
Residue:465
BDBM50252513
NameBDBM50252513
Synonyms:3-(2-(4-(6-fluorobenzo[d]isoxazol-3-yl)piperidin-1-yl)ethyl)-9-hydroxy-2-methyl-6,7,8,9-tetrahydropyrido[1,2-a]pyrimidin-4-one 9-hydroxy risperidone Invega | PALIPERIDONE
TypeSmall organic molecule
Emp. Form.C23H27FN4O3
Mol. Mass.426.4839
SMILESCc1nc2C(O)CCCn2c(=O)c1CCN1CCC(CC1)c1noc2cc(F)ccc12