Reaction Details
TargetMu-type opioid receptor
LigandBDBM50083230
Substrate/Competitorn/a
Ki 214±n/a nM
CommentsPDSP_2074
Citation Hashiba, EHarrison, CGalo', GGuerrini, RRowbotham, DJSmith, GLambert, DG Characterisation and comparison of novel ligands for the nociceptin/orphanin FQ receptor. Naunyn Schmiedebergs Arch Pharmacol363:28-33 (2001) 
 
Mu-type opioid receptor
Name:Mu-type opioid receptor
Type:G Protein-Coupled Receptor (GPCR)
Mol. Mass.:44789.51
Organism:Homo sapiens (Human)
Description:P35372
Residue:400
BDBM50083230
NameBDBM50083230
Synonyms:1-((3R,4R)-1-Cyclooctylmethyl-3-hydroxymethyl-piperidin-4-yl)-3-ethyl-1,3-dihydro-benzoimidazol-2-one 1-[(3R,4R)-1-cyclooctylmethyl-3-hydroxymethyl-4-piperidyl]-3-ethyl-1,3-dihydro-2H-benzimidazol-2-one J-113397
TypeSmall organic molecule
Emp. Form.C24H37N3O2
Mol. Mass.399.5695
SMILESCCn1c2ccccc2n([C@@H]2CCN(CC3CCCCCCC3)C[C@H]2CO)c1=O