Reaction Details
TargetAdenosine receptor A3
LigandBDBM85037
Substrate/Competitorn/a
Ki 56.12±n/a nM
CommentsPDSP_220
Citation Durand, IHGreen, RD Cloning of a chick A3 adenosine receptor: characterization of ligand binding and receptor-effector coupling of chick A1 and A3 adenosine receptors. Naunyn Schmiedebergs Arch Pharmacol363:81-6 (2001) 
 
Adenosine receptor A3
Name:Adenosine receptor A3
Type:Enzyme Catalytic Domain
Mol. Mass.:37723.59
Organism:Chick
Description:A0A8V1ACC1
Residue:338
BDBM85037
NameBDBM85037
Synonyms:ABA | CAS_14375-45-2
TypeSmall organic molecule
Emp. Form.C15H20O4
Mol. Mass.264.3169
SMILESCC(C=C[C@@]1(O)C(C)=CC(=O)CC1(C)C)=CC(O)=O