Reaction Details
TargetAdenosine receptor A3
LigandBDBM85036
Substrate/Competitorn/a
Ki 36.6±n/a nM
CommentsPDSP_458
Citation Durand, IHGreen, RD Cloning of a chick A3 adenosine receptor: characterization of ligand binding and receptor-effector coupling of chick A1 and A3 adenosine receptors. Naunyn Schmiedebergs Arch Pharmacol363:81-6 (2001) 
 
Adenosine receptor A3
Name:Adenosine receptor A3
Type:Enzyme Catalytic Domain
Mol. Mass.:37723.59
Organism:Chick
Description:A0A8V1ACC1
Residue:338
BDBM85036
NameBDBM85036
Synonyms:BW-A1433 CAS_129447 | NSC_129447
TypeSmall organic molecule
Emp. Form.C20H22N4O4
Mol. Mass.382.4131
SMILESCCCn1c2nc([nH]c2c(=O)n(CCC)c1=O)-c1ccc(C=CC(O)=O)cc1