Reaction Details
TargetAdenosine receptor A3
LigandBDBM50008415
Substrate/Competitorn/a
Ki 6.82±n/a nM
CommentsPDSP_2055
Citation Durand, IHGreen, RD Cloning of a chick A3 adenosine receptor: characterization of ligand binding and receptor-effector coupling of chick A1 and A3 adenosine receptors. Naunyn Schmiedebergs Arch Pharmacol363:81-6 (2001) 
 
Adenosine receptor A3
Name:Adenosine receptor A3
Type:Enzyme Catalytic Domain
Mol. Mass.:37723.59
Organism:Chick
Description:A0A8V1ACC1
Residue:338
BDBM50008415
NameBDBM50008415
Synonyms:2-(2-Chloro-6-cyclopentylamino-purin-9-yl)-5-hydroxymethyl-tetrahydro-furan-3,4-diol CCPA
TypeSmall organic molecule
Emp. Form.C15H20ClN5O4
Mol. Mass.369.803
SMILESOCC1OC(C(O)C1O)n1cnc2c(NC3CCCC3)nc(Cl)nc12