Reaction Details
TargetAdenosine receptor A3
LigandBDBM50034171
Substrate/Competitorn/a
Ki 2.8±n/a nM
CommentsPDSP_947
Citation Durand, IHGreen, RD Cloning of a chick A3 adenosine receptor: characterization of ligand binding and receptor-effector coupling of chick A1 and A3 adenosine receptors. Naunyn Schmiedebergs Arch Pharmacol363:81-6 (2001) 
 
Adenosine receptor A3
Name:Adenosine receptor A3
Type:Enzyme Catalytic Domain
Mol. Mass.:37723.59
Organism:Chick
Description:A0A8V1ACC1
Residue:338
BDBM50034171
NameBDBM50034171
Synonyms:3,4-Dihydroxy-5-[6-(3-iodo-benzylamino)-purin-9-yl]-tetrahydro-furan-2-carboxylic acid methylamide IB-MECA
TypeSmall organic molecule
Emp. Form.C18H19IN6O4
Mol. Mass.510.2857
SMILESCNC(=O)C1OC(C(O)C1O)n1cnc2c(NCc3cccc(I)c3)ncnc12