Reaction Details
TargetAdenosine receptor A3
LigandBDBM85775
Substrate/Competitorn/a
Ki 990.18±n/a nM
CommentsPDSP_2053
Citation Durand, IHGreen, RD Cloning of a chick A3 adenosine receptor: characterization of ligand binding and receptor-effector coupling of chick A1 and A3 adenosine receptors. Naunyn Schmiedebergs Arch Pharmacol363:81-6 (2001) 
 
Adenosine receptor A3
Name:Adenosine receptor A3
Type:Enzyme Catalytic Domain
Mol. Mass.:37723.59
Organism:Chick
Description:A0A8V1ACC1
Residue:338
BDBM85775
NameBDBM85775
Synonyms:CHEMBL315984 | MRS1097
TypeSmall organic molecule
Emp. Form.C26H27NO4
Mol. Mass.417.4969
SMILESCCOC(=O)C1C(\C=C\c2ccccc2)C(C(=O)OCC)=C(N=C1C)c1ccccc1