Reaction Details
Target5-hydroxytryptamine receptor 4
LigandBDBM85778
Substrate/Competitorn/a
Ki 2±n/a nM
CommentsPDSP_2063
Citation Bach, TSyversveen, TKvingedal, AMKrobert, KABrattelid, TKaumann, AJLevy, FO 5HT4(a) and 5-HT4(b) receptors have nearly identical pharmacology and are both expressed in human atrium and ventricle. Naunyn Schmiedebergs Arch Pharmacol363:146-60 (2001) 
 
5-hydroxytryptamine receptor 4
Name:5-hydroxytryptamine receptor 4
Type:Enzyme
Mol. Mass.:43767.54
Organism:Homo sapiens (Human)
Description:Q13639
Residue:388
BDBM85778
NameBDBM85778
Synonyms:CAS_135938-17-9 | SB203186
TypeSmall organic molecule
Emp. Form.C16H20N2O2
Mol. Mass.272.3422
SMILESO=C(OCCN1CCCCC1)c1c[nH]c2ccccc12