Reaction Details
Target5-hydroxytryptamine receptor 4
LigandBDBM29525
Substrate/Competitorn/a
Ki 0.05±n/a nM
CommentsPDSP_880
Citation Bach, TSyversveen, TKvingedal, AMKrobert, KABrattelid, TKaumann, AJLevy, FO 5HT4(a) and 5-HT4(b) receptors have nearly identical pharmacology and are both expressed in human atrium and ventricle. Naunyn Schmiedebergs Arch Pharmacol363:146-60 (2001) 
 
5-hydroxytryptamine receptor 4
Name:5-hydroxytryptamine receptor 4
Type:Enzyme
Mol. Mass.:43767.54
Organism:Homo sapiens (Human)
Description:Q13639
Residue:388
BDBM29525
NameBDBM29525
Synonyms:3H-GR113808 GR 113808 [3H]GR113808
Typeradiolabeled ligand
Emp. Form.C19H27N3O4S
Mol. Mass.393.5
SMILESCn1cc(C(=O)OCC2CCN(CCNS(C)(=O)=O)CC2)c2ccccc12