Reaction Details
TargetAlpha-2C adrenergic receptor
LigandBDBM85784
Substrate/Competitorn/a
Ki 6.2±n/a nM
CommentsPDSP_4022
Citation Bylund, DBGerety, MEHappe, HKMurrin, LC A robust GTP-induced shift in alpha(2)-adrenoceptor agonist affinity in tissue sections from rat brain. J Neurosci Methods105:159-66 (2001) 
 
Alpha-2C adrenergic receptor
Name:Alpha-2C adrenergic receptor
Type:Enzyme Catalytic Domain
Mol. Mass.:49890.50
Organism:RAT
Description:adrenergic Alpha2 0 RAT::P22086
Residue:458
BDBM85784
NameBDBM85784
Synonyms:Brimonidine GppNHp | CAS_59803-98-4
TypeSmall organic molecule
Emp. Form.C10H17N6O13P3
Mol. Mass.522.1957
SMILESNc1nc2n(cnc2c(=O)[nH]1)[C@@H]1O[C@H](COP(O)(=O)OP(O)(=O)NP(O)(O)=O)[C@@H](O)[C@H]1O