Reaction Details
TargetMuscarinic acetylcholine receptor M3
LigandBDBM50176065
Substrate/Competitorn/a
Ki 2.4±n/a nM
CommentsPDSP_111
Citation Bockman, CSBradley, MEDang, HKZeng, WScofield, MADowd, FJ Molecular and pharmacological characterization of muscarinic receptor subtypes in a rat parotid gland cell line: comparison with native parotid gland. J Pharmacol Exp Ther297:718-26 (2001) Muscarinic acetylcholine receptor M3
Name:Muscarinic acetylcholine receptor M3
Type:Enzyme Catalytic Domain
Mol. Mass.:66086.66
Organism:RAT
Description:Cholinergic, muscarinic M3 CHRM3 RAT::P08483
Residue:589
BDBM50176065
NameBDBM50176065
Synonyms:4-DAMP Acetic acid 4-[(4-acetoxy-phenyl)-pyridin-2-yl-methyl]-phenyl ester CHEMBL76897
TypeSmall organic molecule
Emp. Form.C21H26NO2
Mol. Mass.324.4361
SMILESC[N+]1(C)CCC(CC1)OC(=O)C(c1ccccc1)c1ccccc1