Reaction Details
TargetAlpha-2A adrenergic receptor [16-465]
LigandBDBM50001888
Substrate/Competitorn/a
Ki 913±n/a nM
CommentsPDSP_513
Citation Naselsky, DPAshton, DRuffolo, RRHieble, JP Rabbit alpha2-adrenoceptors: both platelets and adipocytes have alpha2A-pharmacology. J Pharmacol Exp Ther298:219-25 (2001) Alpha-2A adrenergic receptor [16-465]
Name:Alpha-2A adrenergic receptor [16-465]
Type:G-protein coupled receptor
Mol. Mass.:48961.69
Organism:Rattus norvegicus (rat)
Description:P22909[16-465]
Residue:450
BDBM50001888
NameBDBM50001888
Synonyms:(chloropromazine) [3-(2-Chloro-phenothiazin-10-yl)-propyl]-dimethyl-amine 1-(2-Allyl-phenoxy)-3-isopropylamino-propan-2-ol 3-(2-chloro-10H-phenothiazin-10-yl)-N,N-dimethylpropan-1-amine CHLORPROMAZINE CHLORPROMAZINE HYDROCHLORIDE CHLORPROMAZINE TANNATE PROMAPAR THORAZINE [3-(2-Chloro-phenothiazin-10-yl)-propyl]-dimethyl-amine( Chlorpromazine) chloropromazine | med.21724, Compound 15
TypeSmall organic molecule
Emp. Form.C17H19ClN2S
Mol. Mass.318.864
SMILESCN(C)CCCN1c2ccccc2Sc2ccc(Cl)cc12