Reaction Details
TargetNeuropeptide Y receptor type 2
LigandBDBM84995
Substrate/Competitorn/a
Ki 2.62±n/a nM
CommentsPDSP_1371
Citation Goumain, MVoisin, TLorinet, AMDucroc, RTsocas, ARozé, CRouet-Benzineb, PHerzog, HBalasubramaniam, ALaburthe, M The peptide YY-preferring receptor mediating inhibition of small intestinal secretion is a peripheral Y(2) receptor: pharmacological evidence and molecular cloning. Mol Pharmacol60:124-34 (2001) 
 
Neuropeptide Y receptor type 2
Name:Neuropeptide Y receptor type 2
Type:Enzyme Catalytic Domain
Mol. Mass.:42514.44
Organism:RAT
Description:NPY-Y2 NPY2R RAT::Q9ERC0
Residue:381
BDBM84995
NameBDBM84995
Synonyms:NPY 13-36, human, rat | PYY13-36, rat
TypeSmall organic molecule
Emp. Form.C134H207N41O36S
Mol. Mass.3000.395
SMILESCC[C@H](C)[C@H](NC(=O)[C@H](Cc1ccc(O)cc1)NC(=O)[C@H](Cc1cnc[nH]1)NC(=O)[C@H](CCCN=C(N)N)NC(=O)[C@H](CC(C)C)NC(=O)[C@H](C)NC(=O)[C@H](CO)NC(=O)[C@H](Cc1ccc(O)cc1)NC(=O)[C@H](Cc1ccc(O)cc1)NC(=O)[C@H](CCCN=C(N)N)NC(=O)[C@H](C)NC(=O)[C@H](CCSC)NC(=O)[C@H](CC(O)=O)NC(=O)[C@H](CCC(O)=O)NC(=O)[C@H](C)NC(=O)[C@@H]1CCCN1)C(=O)N[C@@H](CC(N)=O)C(=O)N[C@@H](CC(C)C)C(=O)N[C@@H]([C@@H](C)CC)C(=O)N[C@@H]([C@@H](C)O)C(=O)N[C@@H](CCCN=C(N)N)C(=O)N[C@@H](CCC(N)=O)C(=O)N[C@@H](CCCN=C(N)N)C(=O)N[C@@H](Cc1ccc(O)cc1)C(N)=O