Reaction Details
TargetCannabinoid receptor 1
LigandBDBM50080102
Substrate/Competitorn/a
Ki 87±n/a nM
CommentsPDSP_1002
Citation Breivogel, CSGriffin, GDi Marzo, VMartin, BR Evidence for a new G protein-coupled cannabinoid receptor in mouse brain. Mol Pharmacol60:155-63 (2001) Cannabinoid receptor 1
Name:Cannabinoid receptor 1
Type:G Protein-Coupled Receptor (GPCR)
Mol. Mass.:52856.55
Organism:Rattus norvegicus (rat)
Description:P20272
Residue:473
BDBM50080102
NameBDBM50080102
Synonyms:CHEMBL71810 Naphthalen-1-yl-(1-pentyl-1H-pyrrol-3-yl)-methanone
TypeSmall organic molecule
Emp. Form.C20H21NO
Mol. Mass.291.3868
SMILESCCCCCn1ccc(c1)C(=O)c1cccc2ccccc12