Reaction Details
TargetCannabinoid receptor 1
LigandBDBM85796
Substrate/Competitorn/a
Ki 399±n/a nM
CommentsPDSP_1003
Citation Breivogel, CSGriffin, GDi Marzo, VMartin, BR Evidence for a new G protein-coupled cannabinoid receptor in mouse brain. Mol Pharmacol60:155-63 (2001) Cannabinoid receptor 1
Name:Cannabinoid receptor 1
Type:G Protein-Coupled Receptor (GPCR)
Mol. Mass.:52856.55
Organism:Rattus norvegicus (rat)
Description:P20272
Residue:473
BDBM85796
NameBDBM85796
Synonyms:CAS_162934-74-9 | JWH-031
TypeSmall organic molecule
Emp. Form.C21H23NO
Mol. Mass.305.4134
SMILESCCCCCCn1ccc(c1)C(=O)c1cccc2ccccc12