Reaction Details
TargetCannabinoid receptor 1
LigandBDBM85803
Substrate/Competitorn/a
Ki 5.7±n/a nM
CommentsPDSP_1400
Citation Breivogel, CSGriffin, GDi Marzo, VMartin, BR Evidence for a new G protein-coupled cannabinoid receptor in mouse brain. Mol Pharmacol60:155-63 (2001) Cannabinoid receptor 1
Name:Cannabinoid receptor 1
Type:G Protein-Coupled Receptor (GPCR)
Mol. Mass.:52856.55
Organism:Rattus norvegicus (rat)
Description:P20272
Residue:473
BDBM85803
NameBDBM85803
Synonyms:(5Z,8Z,11Z,14Z)-N-(2-Fluoroethyl)-2-methyl-5,8,11,14-icosatetrenamide | O-689
TypeSmall organic molecule
Emp. Form.C23H38FNO
Mol. Mass.363.5523
SMILESCCCCC\C=C\C\C=C\C\C=C\C\C=C\CCC(C)C(=O)NCCF