Reaction Details
TargetD(4) dopamine receptor
LigandBDBM85818
Substrate/Competitorn/a
Ki>10000±n/a nM
CommentsPDSP_2008
Citation Roth, BLErnsberger, PSteinberg, SARao, SRauser, LSavage, JHufeisen, SBerridge, MSMuzic, RF The in vitro pharmacology of the beta-adrenergic receptor pet ligand (s)-fluorocarazolol reveals high affinity for cloned beta-adrenergic receptors and moderate affinity for the human 5-HT1A receptor. Psychopharmacology (Berl)157:111-4 (2001) 
 
D(4) dopamine receptor
Name:D(4) dopamine receptor
Type:Enzyme Catalytic Domain
Mol. Mass.:41307.65
Organism:RAT
Description:DOPAMINE D4.4 0 RAT::P30729
Residue:387
BDBM85818
NameBDBM85818
Synonyms:Fluorocarazolol,(R) | Fluorocarazolol,(S)
TypeSmall organic molecule
Emp. Form.C18H21FN2O2
Mol. Mass.316.3699
SMILESCC(CF)NCC(O)COc1cccc2[nH]c3ccccc3c12