Reaction Details
TargetGlutamate receptor ionotropic, kainate 1
LigandBDBM50316376
Substrate/Competitorn/a
Ki 3600±n/a nM
CommentsPDSP_3687
Citation Johansen, TNStensbøl, TBNielsen, BVogensen, SBFrydenvang, KSløk, FABräüner-Osborne, HMadsen, UKrogsgaard-Larsen, P Resolution, configurational assignment, and enantiopharmacology at glutamate receptors of 2-amino-3-(3-carboxy-5-methyl-4-isoxazolyl)propionic acid (ACPA) and demethyl-ACPA. Chirality13:523-32 (2001) 
 
Glutamate receptor ionotropic, kainate 1
Name:Glutamate receptor ionotropic, kainate 1
Type:Enzyme Catalytic Domain
Mol. Mass.:107860.82
Organism:RAT
Description:P22756
Residue:949
BDBM50316376
NameBDBM50316376
Synonyms:(S)-2-amino-3-(3-carboxy-5-methyl-4-isoxazolyl)propionic acid CHEMBL602962 | S)-4-(2-amino-2-carboxyethyl)-5-methylisoxazole-3-carboxylic acid
TypeSmall organic molecule
Emp. Form.C8H10N2O5
Mol. Mass.214.1754
SMILESCc1onc(C(O)=O)c1C[C@H](N)C(O)=O