Reaction Details
Target5-hydroxytryptamine receptor 2C
LigandBDBM85827
Substrate/Competitorn/a
Ki 500±n/a nM
CommentsPDSP_2298
Citation Rënyi, LEvenden, JLFowler, CJJerning, EKelder, DLake-Bakaar, DLarsson, LGMohell, NSällemark, MRoss, SB The pharmacological profile of (R)-3,4-dihydro-N-isopropyl-3-(N-isopropyl-N-propylamino)-2H-1-benzopyran-5-carboxamide, a selective 5-hydroxytryptamine(1A) receptor agonist. J Pharmacol Exp Ther299:883-93 (2001) 5-hydroxytryptamine receptor 2C
Name:5-hydroxytryptamine receptor 2C
Type:Enzyme
Mol. Mass.:51935.10
Organism:Rattus norvegicus (Rat)
Description:P08909
Residue:460
BDBM85827
NameBDBM85827
Synonyms:(R)-3-[Isopropyl(propyl)amino]-3,4-dihydro-2H-1-benzopyran-5-carboxamide | NAE-111
TypeSmall organic molecule
Emp. Form.C16H24N2O2
Mol. Mass.276.374
SMILESCCCN(C(C)C)[C@H]1COc2cccc(C(N)=O)c2C1