Reaction Details
Target5-hydroxytryptamine receptor 6
LigandBDBM85827
Substrate/Competitorn/a
Ki>10000±n/a nM
CommentsPDSP_2298
Citation Rënyi, LEvenden, JLFowler, CJJerning, EKelder, DLake-Bakaar, DLarsson, LGMohell, NSällemark, MRoss, SB The pharmacological profile of (R)-3,4-dihydro-N-isopropyl-3-(N-isopropyl-N-propylamino)-2H-1-benzopyran-5-carboxamide, a selective 5-hydroxytryptamine(1A) receptor agonist. J Pharmacol Exp Ther299:883-93 (2001) 5-hydroxytryptamine receptor 6
Name:5-hydroxytryptamine receptor 6
Type:Enzyme Catalytic Domain
Mol. Mass.:46945.51
Organism:RAT
Description:5-HT6 HTR6 RAT::P31388
Residue:436
BDBM85827
NameBDBM85827
Synonyms:(R)-3-[Isopropyl(propyl)amino]-3,4-dihydro-2H-1-benzopyran-5-carboxamide | NAE-111
TypeSmall organic molecule
Emp. Form.C16H24N2O2
Mol. Mass.276.374
SMILESCCCN(C(C)C)[C@H]1COc2cccc(C(N)=O)c2C1