Reaction Details
TargetNeuromedin-K receptor
LigandBDBM50034043
Substrate/Competitorn/a
Ki>10000±n/a nM
CommentsPDSP_964
Citation Kalkman, HOSubramanian, NHoyer, D Extended radioligand binding profile of iloperidone: a broad spectrum dopamine/serotonin/norepinephrine receptor antagonist for the management of psychotic disorders. Neuropsychopharmacology25:904-14 (2001) 
 
Neuromedin-K receptor
Name:Neuromedin-K receptor
Type:Enzyme
Mol. Mass.:52221.96
Organism:Homo sapiens (Human)
Description:P29371
Residue:465
BDBM50034043
NameBDBM50034043
Synonyms:1-(4-{3-[4-(6-Fluoro-benzo[d]isoxazol-3-yl)-piperidin-1-yl]-propoxy}-3-methoxy-phenyl)-ethanone ILOPERIDONE
TypeSmall organic molecule
Emp. Form.C24H27FN2O4
Mol. Mass.426.4806
SMILESCOc1cc(ccc1OCCCN1CCC(CC1)c1noc2cc(F)ccc12)C(C)=O