Reaction Details
TargetHistamine H1 receptor
LigandBDBM81466
Substrate/Competitorn/a
Ki 2.51±n/a nM
CommentsPDSP_1061
Citation Gillard, MVan Der Perren, CMoguilevsky, NMassingham, RChatelain, P Binding characteristics of cetirizine and levocetirizine to human H(1) histamine receptors: contribution of Lys(191) and Thr(194). Mol Pharmacol61:391-9 (2002) 
 
Histamine H1 receptor
Name:Histamine H1 receptor
Type:G Protein-Coupled Receptor (GPCR)
Mol. Mass.:55808.72
Organism:Homo sapiens (Human)
Description:Cell pellets from SK-N-MC cells transfected with human H1 receptor were used in binding assay.
Residue:487
BDBM81466
NameBDBM81466
Synonyms:CAS_23095-76-3 l-Chlorpheniramine
TypeSmall organic molecule
Emp. Form.C10H7ClO4
Mol. Mass.226.613
SMILESOC(=O)C=CC(=O)Oc1ccc(Cl)cc1