Reaction Details
TargetVIP peptides
LigandBDBM85871
Substrate/Competitorn/a
Ki 1.4±n/a nM
CommentsPDSP_2130
Citation Igarashi, HIto, THou, WMantey, SAPradhan, TKUlrich, CDHocart, SJCoy, DHJensen, RT Elucidation of vasoactive intestinal peptide pharmacophore for VPAC(1) receptors in human, rat, and guinea pig. J Pharmacol Exp Ther301:37-50 (2002) 
 
VIP peptides
Name:VIP peptides
Type:Enzyme Catalytic Domain
Mol. Mass.:19168.43
Organism:Homo sapiens (Human)
Description:P01282
Residue:170
BDBM85871
NameBDBM85871
Synonyms:VIP Ala9
TypeSmall organic molecule
Emp. Form.C146H237N43O41S
Mol. Mass.3282.772
SMILESCC[C@H](C)[C@H](NC(=O)[C@H](CO)NC(=O)[C@H](CC(N)=O)NC(=O)[C@H](CC(C)C)NC(=O)[C@H](Cc1ccc(O)cc1)NC(=O)[C@H](CCCCN)NC(=O)[C@H](CCCCN)NC(=O)[C@@H](NC(=O)[C@H](C)NC(=O)[C@H](CCSC)NC(=O)[C@H](CCC(N)=O)NC(=O)[C@H](CCCCN)NC(=O)[C@H](CCCN=C(N)N)NC(=O)[C@H](CC(C)C)NC(=O)[C@H](CCCN=C(N)N)NC(=O)C(NC(=O)[C@H](Cc1ccc(O)cc1)NC(=O)[C@H](C)NC(=O)[C@H](CC(O)=O)NC(=O)[C@@H](NC(=O)[C@H](Cc1ccccc1)NC(=O)[C@@H](NC(=O)[C@H](C)NC(=O)[C@H](CC(O)=O)NC(=O)[C@H](CO)NC(=O)[C@@H](N)Cc1cnc[nH]1)C(C)C)[C@@H](C)O)[C@@H](C)O)C(C)C)C(=O)N[C@@H](CC(C)C)C(=O)N[C@@H](CC(N)=O)C(N)=O