Reaction Details
TargetSodium-dependent serotonin transporter
LigandBDBM85934
Substrate/Competitorn/a
Ki>10000±n/a nM
CommentsPDSP_2113
Citation Schweri, MMDeutsch, HMMassey, ATHoltzman, SG Biochemical and behavioral characterization of novel methylphenidate analogs. J Pharmacol Exp Ther301:527-35 (2002) 
 
Sodium-dependent serotonin transporter
Name:Sodium-dependent serotonin transporter
Type:Multi-pass membrane protein
Mol. Mass.:70168.43
Organism:Rattus norvegicus (rat)
Description:P31652
Residue:630
BDBM85934
NameBDBM85934
Synonyms:4MeTMP
TypeSmall organic molecule
Emp. Form.C15H21NO2
Mol. Mass.247.3327
SMILESCOC(=O)[C@@H]([C@@H]1CCCCN1)c1ccc(C)cc1