Reaction Details
TargetSodium-dependent dopamine transporter
LigandBDBM85936
Substrate/Competitorn/a
Ki 5.1±n/a nM
CommentsPDSP_2120
Citation Schweri, MMDeutsch, HMMassey, ATHoltzman, SG Biochemical and behavioral characterization of novel methylphenidate analogs. J Pharmacol Exp Ther301:527-35 (2002) 
 
Sodium-dependent dopamine transporter
Name:Sodium-dependent dopamine transporter
Type:Multi-pass membrane protein
Mol. Mass.:68749.45
Organism:Rattus norvegicus (rat)
Description:P23977
Residue:619
BDBM85936
NameBDBM85936
Synonyms:3CTMP
TypeSmall organic molecule
Emp. Form.C14H18ClNO2
Mol. Mass.267.751
SMILESCOC(=O)[C@@H]([C@@H]1CCCCN1)c1cccc(Cl)c1