Reaction Details
TargetSodium-dependent serotonin transporter
LigandBDBM25870
Substrate/Competitorn/a
Ki 0.82±n/a nM
CommentsPDSP_532
Citation Davids, EZhang, KKula, NSTarazi, FIBaldessarini, RJ Effects of norepinephrine and serotonin transporter inhibitors on hyperactivity induced by neonatal 6-hydroxydopamine lesioning in rats. J Pharmacol Exp Ther301:1097-102 (2002) 
 
Sodium-dependent serotonin transporter
Name:Sodium-dependent serotonin transporter
Type:Multi-pass membrane protein
Mol. Mass.:70168.43
Organism:Rattus norvegicus (rat)
Description:P31652
Residue:630
BDBM25870
NameBDBM25870
Synonyms:1-[3-(dimethylamino)propyl]-1-(4-fluorophenyl)-1,3-dihydro-2-benzofuran-5-carbonitrile CITALOPRAM Escitalopram [3H]Cytalopram [3H]Lexapro
Typeradiolabeled ligand
Emp. Form.C20H21FN2O
Mol. Mass.324.3919
SMILESCN(C)CCCC1(OCc2cc(ccc12)C#N)c1ccc(F)cc1