Reaction Details
TargetNeuropeptide Y receptor type 1
LigandBDBM85793
Substrate/Competitorn/a
Ki>10000±n/a nM
CommentsPDSP_368
Citation Holmberg, SKMikko, SBoswell, TZoorob, RLarhammar, D Pharmacological characterization of cloned chicken neuropeptide Y receptors Y1 and Y5. J Neurochem81:462-71 (2002) 
 
Neuropeptide Y receptor type 1
Name:Neuropeptide Y receptor type 1
Type:Enzyme Catalytic Domain
Mol. Mass.:44370.70
Organism:Chicken
Description:Q8QFM1
Residue:385
BDBM85793
NameBDBM85793
Synonyms:BIIE0246 NSC_5311024
TypeSmall organic molecule
Emp. Form.C49H57N11O6
Mol. Mass.896.047
SMILES[#7]\[#6](-[#7])=[#7]\[#6]-[#6]-[#6]-[#6](-[#7]-[#6](=O)-[#6]C1([#6]-[#6](=O)-[#7]-2-[#6]-[#6]-[#7](-[#6]-[#6]-2)-[#6]-2-c3ccccc3-[#7]-[#6](=O)-c3ccccc-23)[#6]-[#6]-[#6]-[#6]1)-[#6](=O)-[#7]-[#6]-[#6]-n1c(=O)n(-c2ccccc2)n(-c2ccccc2)c1=O