Reaction Details
TargetNeuropeptide Y receptor type 1
LigandBDBM50089038
Substrate/Competitorn/a
Ki>10000±n/a nM
CommentsPDSP_7139
Citation Holmberg, SKMikko, SBoswell, TZoorob, RLarhammar, D Pharmacological characterization of cloned chicken neuropeptide Y receptors Y1 and Y5. J Neurochem81:462-71 (2002) 
 
Neuropeptide Y receptor type 1
Name:Neuropeptide Y receptor type 1
Type:Enzyme Catalytic Domain
Mol. Mass.:44370.70
Organism:Chicken
Description:Q8QFM1
Residue:385
BDBM50089038
NameBDBM50089038
Synonyms:CGP 71683 CHEMBL17645 Naphthalene-1-sulfonic acid {4-[(4-amino-quinazolin-2-ylamino)-methyl]-cyclohexylmethyl}-amide
TypeSmall organic molecule
Emp. Form.C26H29N5O2S
Mol. Mass.475.606
SMILESNc1nc(NC[C@H]2CC[C@H](CNS(=O)(=O)c3cccc4ccccc34)CC2)nc2ccccc12