Reaction Details
TargetNeuropeptide Y receptor type 1
LigandBDBM85791
Substrate/Competitorn/a
Ki>10000±n/a nM
CommentsPDSP_1512
Citation Holmberg, SKMikko, SBoswell, TZoorob, RLarhammar, D Pharmacological characterization of cloned chicken neuropeptide Y receptors Y1 and Y5. J Neurochem81:462-71 (2002) 
 
Neuropeptide Y receptor type 1
Name:Neuropeptide Y receptor type 1
Type:Enzyme Catalytic Domain
Mol. Mass.:44370.70
Organism:Chicken
Description:Q8QFM1
Residue:385
BDBM85791
NameBDBM85791
Synonyms:CAS_59763-91-6 PP, rat
TypeSmall organic molecule
Emp. Form.C31H24O3
Mol. Mass.444.5205
SMILESOc1c(C2CC(Cc3ccccc23)c2ccc(cc2)-c2ccccc2)c(=O)oc2ccccc12