Reaction Details
TargetNeuropeptide Y receptor type 5
LigandBDBM84996
Substrate/Competitorn/a
Ki>10000±n/a nM
CommentsPDSP_2993
Citation Holmberg, SKMikko, SBoswell, TZoorob, RLarhammar, D Pharmacological characterization of cloned chicken neuropeptide Y receptors Y1 and Y5. J Neurochem81:462-71 (2002) 
 
Neuropeptide Y receptor type 5
Name:Neuropeptide Y receptor type 5
Type:Enzyme Catalytic Domain
Mol. Mass.:50065.15
Organism:Chicken
Description:Q8QFM2
Residue:443
BDBM84996
NameBDBM84996
Synonyms:BIBP3226 NSC_5311023
TypeSmall organic molecule
Emp. Form.C27H31N5O3
Mol. Mass.473.5667
SMILES[#7]\[#6](-[#7])=[#7]\[#6]-[#6]-[#6]-[#6](-[#7]-[#6](=O)-[#6](-c1ccccc1)-c1ccccc1)-[#6](=O)-[#7]-[#6]-c1ccc(-[#8])cc1