Reaction Details
TargetNeuropeptide Y receptor type 5
LigandBDBM85535
Substrate/Competitorn/a
Ki>10000±n/a nM
CommentsPDSP_6857
Citation Holmberg, SKMikko, SBoswell, TZoorob, RLarhammar, D Pharmacological characterization of cloned chicken neuropeptide Y receptors Y1 and Y5. J Neurochem81:462-71 (2002) 
 
Neuropeptide Y receptor type 5
Name:Neuropeptide Y receptor type 5
Type:Enzyme Catalytic Domain
Mol. Mass.:50065.15
Organism:Chicken
Description:Q8QFM2
Residue:443
BDBM85535
NameBDBM85535
Synonyms:CAS_5312150 | SR 120819A
TypeSmall organic molecule
Emp. Form.C43H54N6O4S
Mol. Mass.750.992
SMILESCN(C)CC1CCC(CN=C(N)c2ccc(CC(NC(=O)C(Cc3ccccc3)NS(=O)(=O)c3ccc4ccccc4c3)C(=O)N3CCCC3)cc2)CC1