Reaction Details
TargetCannabinoid receptor 2
LigandBDBM21244
Substrate/Competitorn/a
Ki 0.52±n/a nM
CommentsPDSP_572
Citation Mauler, FMittendorf, JHorváth, EDe Vry, J Characterization of the diarylether sulfonylester (-)-(R)-3-(2-hydroxymethylindanyl-4-oxy)phenyl-4,4,4-trifluoro-1-sulfonate (BAY 38-7271) as a potent cannabinoid receptor agonist with neuroprotective properties. J Pharmacol Exp Ther302:359-68 (2002) 
 
Cannabinoid receptor 2
Name:Cannabinoid receptor 2
Type:G Protein-Coupled Receptor (GPCR)
Mol. Mass.:39690.94
Organism:Homo sapiens (Human)
Description:P34972
Residue:360
BDBM21244
NameBDBM21244
Synonyms:2-[(1S,2S,5S)-5-hydroxy-2-(3-hydroxypropyl)cyclohexyl]-5-(2-methyloctan-2-yl)phenol CP 55,940 CP-56667 [(+)-AC],XV [3H]CP55940
Typeradiolabeled ligand
Emp. Form.C24H40O3
Mol. Mass.376.5726
SMILESCCCCCCC(C)(C)c1ccc([C@H]2C[C@@H](O)CC[C@@H]2CCCO)c(O)c1