Reaction Details
TargetCannabinoid receptor 2
LigandBDBM50000729
Substrate/Competitorn/a
Ki 25.06±n/a nM
CommentsPDSP_1838
Citation Mauler, FMittendorf, JHorváth, EDe Vry, J Characterization of the diarylether sulfonylester (-)-(R)-3-(2-hydroxymethylindanyl-4-oxy)phenyl-4,4,4-trifluoro-1-sulfonate (BAY 38-7271) as a potent cannabinoid receptor agonist with neuroprotective properties. J Pharmacol Exp Ther302:359-68 (2002) 
 
Cannabinoid receptor 2
Name:Cannabinoid receptor 2
Type:G Protein-Coupled Receptor (GPCR)
Mol. Mass.:39690.94
Organism:Homo sapiens (Human)
Description:P34972
Residue:360
BDBM50000729
NameBDBM50000729
Synonyms:(+)-6,6,9-Trimethyl-3-pentyl-6a,7,8,10a-tetrahydro-6H-benzo[c]chromen-1-ol 6,6,9-Trimethyl-3-pentyl-6a,7,8,10a-tetrahydro-6H-benzo[c]chromen-1-ol THC, delta 9 | Tetrahydrocannabinol
TypeSmall organic molecule
Emp. Form.C21H30O2
Mol. Mass.314.4617
SMILESCCCCCc1cc(O)c2C3C=C(C)CC[C@H]3C(C)(C)Oc2c1