Reaction Details
Target5-hydroxytryptamine receptor 4
LigandBDBM86038
Substrate/Competitorn/a
Ki 0.6±n/a nM
CommentsPDSP_2965
Citation Moser, PCBergis, OEJegham, SLochead, ADuconseille, ETerranova, JPCaille, DBerque-Bestel, ILezoualc'h, FFischmeister, RDumuis, ABockaert, JGeorge, PSoubrié, PScatton, B SL65.0155, a novel 5-hydroxytryptamine(4) receptor partial agonist with potent cognition-enhancing properties. J Pharmacol Exp Ther302:731-41 (2002) 
 
5-hydroxytryptamine receptor 4
Name:5-hydroxytryptamine receptor 4
Type:Enzyme
Mol. Mass.:43767.54
Organism:Homo sapiens (Human)
Description:Q13639
Residue:388
BDBM86038
NameBDBM86038
Synonyms:SL65.0155 | SL650155
TypeSmall organic molecule
Emp. Form.C23H25ClN4O4
Mol. Mass.456.922
SMILESNc1c(Cl)cc(-c2nn(C3CCN(CCc4ccccc4)CC3)c(=O)o2)c2OCCOc12